change default verifychain level

7 jobs for 234-simple-nf-token-protocol-registration in 123 minutes and 5 seconds (queued for 3 seconds)
Status Job ID Name Coverage
  Build
failed #6463
Linux32-snapshot

00:20:21

failed #6462
Linux64-snapshot

00:18:24

failed #6465
Osx-snapshot

00:03:36

failed #6466
Osx-snapshot-dmg

00:03:20

failed #6464
RaspberryPi-snapshot

00:15:48

failed #6461
Win32-snapshot

00:28:48

failed #6460
Win64-snapshot

00:32:45

 
Name Stage Failure
failed
Osx-snapshot-dmg Build
Preprocessing native_cctools...
./autogen.sh: line 22: libtoolize: command not found
./autogen.sh: line 23: aclocal: command not found
./autogen.sh: line 24: autoconf: command not found
./autogen.sh: line 26: automake: command not found
funcs.mk:231: recipe for target '/home/gitlab-runner/builds/ZU5STFEn/0/crown/crown-core/depends/work/build/x86_64-apple-darwin14/native_cctools/807d6fd1be5d2224872e381870c0a75387fe05e6-685eac2cd55/.stamp_preprocessed' failed
make: *** [/home/gitlab-runner/builds/ZU5STFEn/0/crown/crown-core/depends/work/build/x86_64-apple-darwin14/native_cctools/807d6fd1be5d2224872e381870c0a75387fe05e6-685eac2cd55/.stamp_preprocessed] Error 127
make: Leaving directory '/home/gitlab-runner/builds/ZU5STFEn/0/crown/crown-core/depends'
ERROR: Job failed: exit status 1
failed
Osx-snapshot Build
Preprocessing native_cctools...
./autogen.sh: line 22: libtoolize: command not found
./autogen.sh: line 23: aclocal: command not found
./autogen.sh: line 24: autoconf: command not found
./autogen.sh: line 26: automake: command not found
funcs.mk:231: recipe for target '/home/gitlab-runner/builds/ZU5STFEn/0/crown/crown-core/depends/work/build/x86_64-apple-darwin14/native_cctools/807d6fd1be5d2224872e381870c0a75387fe05e6-685eac2cd55/.stamp_preprocessed' failed
make: *** [/home/gitlab-runner/builds/ZU5STFEn/0/crown/crown-core/depends/work/build/x86_64-apple-darwin14/native_cctools/807d6fd1be5d2224872e381870c0a75387fe05e6-685eac2cd55/.stamp_preprocessed] Error 127
make: Leaving directory '/home/gitlab-runner/builds/ZU5STFEn/0/crown/crown-core/depends'
ERROR: Job failed: exit status 1
failed
RaspberryPi-snapshot Build
Staging miniupnpc...
Postprocessing miniupnpc...
Caching miniupnpc...
copying packages: native_ccache native_comparisontool native_protobuf boost openssl curl qrencode protobuf bdb miniupnpc
to: /home/gitlab-runner/builds/ZU5STFEn/0/crown/crown-core/depends/arm-linux-gnueabihf
make: Leaving directory '/home/gitlab-runner/builds/ZU5STFEn/0/crown/crown-core/depends'
$ ./autogen.sh
./autogen.sh: 9: ./autogen.sh: autoreconf: not found
ERROR: Job failed: exit status 1
failed
Linux32-snapshot Build
and FREETYPE_LIBS to avoid the need to call pkg-config.
See the pkg-config man page for more details.

To get pkg-config, see <http://pkg-config.freedesktop.org/>.
See `config.log' for more details
funcs.mk:231: recipe for target '/home/gitlab-runner/builds/ZU5STFEn/0/crown/crown-core/depends/work/build/i686-pc-linux-gnu/fontconfig/2.11.1-8b2d623b57b/./.stamp_configured' failed
make: *** [/home/gitlab-runner/builds/ZU5STFEn/0/crown/crown-core/depends/work/build/i686-pc-linux-gnu/fontconfig/2.11.1-8b2d623b57b/./.stamp_configured] Error 1
make: Leaving directory '/home/gitlab-runner/builds/ZU5STFEn/0/crown/crown-core/depends'
ERROR: Job failed: exit status 1
failed
Linux64-snapshot Build
and FREETYPE_LIBS to avoid the need to call pkg-config.
See the pkg-config man page for more details.

To get pkg-config, see <http://pkg-config.freedesktop.org/>.
See `config.log' for more details
funcs.mk:231: recipe for target '/home/gitlab-runner/builds/ZU5STFEn/0/crown/crown-core/depends/work/build/x86_64-unknown-linux-gnu/fontconfig/2.11.1-8b2d623b57b/./.stamp_configured' failed
make: *** [/home/gitlab-runner/builds/ZU5STFEn/0/crown/crown-core/depends/work/build/x86_64-unknown-linux-gnu/fontconfig/2.11.1-8b2d623b57b/./.stamp_configured] Error 1
make: Leaving directory '/home/gitlab-runner/builds/ZU5STFEn/0/crown/crown-core/depends'
ERROR: Job failed: exit status 1
failed
Win32-snapshot Build
Creating qmake...
make[1]: Entering directory '/home/gitlab-runner/builds/ZU5STFEn/0/crown/crown-core/depends/work/build/i686-w64-mingw32/qt/5.5.0-3112248efa2/qtbase/qmake'
make[1]: Leaving directory '/home/gitlab-runner/builds/ZU5STFEn/0/crown/crown-core/depends/work/build/i686-w64-mingw32/qt/5.5.0-3112248efa2/qtbase/qmake'
Running configuration tests...
Could not detect pkg-config from mkspec or PATH.
funcs.mk:231: recipe for target '/home/gitlab-runner/builds/ZU5STFEn/0/crown/crown-core/depends/work/build/i686-w64-mingw32/qt/5.5.0-3112248efa2/qtbase/.stamp_configured' failed
make: *** [/home/gitlab-runner/builds/ZU5STFEn/0/crown/crown-core/depends/work/build/i686-w64-mingw32/qt/5.5.0-3112248efa2/qtbase/.stamp_configured] Error 101
make: Leaving directory '/home/gitlab-runner/builds/ZU5STFEn/0/crown/crown-core/depends'
ERROR: Job failed: exit status 1
failed
Win64-snapshot Build
Creating qmake...
make[1]: Entering directory '/home/gitlab-runner/builds/ZU5STFEn/0/crown/crown-core/depends/work/build/x86_64-w64-mingw32/qt/5.5.0-3112248efa2/qtbase/qmake'
make[1]: Leaving directory '/home/gitlab-runner/builds/ZU5STFEn/0/crown/crown-core/depends/work/build/x86_64-w64-mingw32/qt/5.5.0-3112248efa2/qtbase/qmake'
Running configuration tests...
Could not detect pkg-config from mkspec or PATH.
funcs.mk:231: recipe for target '/home/gitlab-runner/builds/ZU5STFEn/0/crown/crown-core/depends/work/build/x86_64-w64-mingw32/qt/5.5.0-3112248efa2/qtbase/.stamp_configured' failed
make: *** [/home/gitlab-runner/builds/ZU5STFEn/0/crown/crown-core/depends/work/build/x86_64-w64-mingw32/qt/5.5.0-3112248efa2/qtbase/.stamp_configured] Error 101
make: Leaving directory '/home/gitlab-runner/builds/ZU5STFEn/0/crown/crown-core/depends'
ERROR: Job failed: exit status 1