proof hash checking added to connect block

6 jobs for proof_check in 139 minutes and 39 seconds (queued for 1 second)
latest
Status Job ID Name Coverage
  Build
failed #2883
Linux32-snapshot

00:28:45

failed #2882
Linux64-snapshot

00:28:51

failed #2885
Osx-snapshot

00:31:53

failed #2884
RaspberryPi-snapshot

00:01:14

failed #2881
Win32-snapshot

00:24:27

failed #2880
Win64-snapshot

00:24:25

 
Name Stage Failure
failed
Osx-snapshot Build
checking whether the Boost::Thread library is available... no
checking whether the Boost::Chrono library is available... yes
checking for exit in -lboost_chrono-mt... yes
checking for working boost reduced exports... yes
checking whether the linker accepts -Wl,--exclude-libs,ALL... no
checking whether the Boost::Unit_Test_Framework library is available... no
checking for dynamic linked boost test... no
configure: error: No working boost sleep implementation found.
ERROR: Job failed: exit status 1
failed
RaspberryPi-snapshot Build
if test -d "crown-arm-linux-gnueabihf"; then find "crown-arm-linux-gnueabihf" -type d ! -perm -200 -exec chmod u+w {} ';' && rm -rf "crown-arm-linux-gnueabihf" || { sleep 5 && rm -rf "crown-arm-linux-gnueabihf"; }; else :; fi
test -d "crown-arm-linux-gnueabihf" || mkdir "crown-arm-linux-gnueabihf"
(cd src && make top_distdir=../crown-arm-linux-gnueabihf distdir=../crown-arm-linux-gnueabihf/src \
am__remove_distdir=: am__skip_length_check=: am__skip_mode_fix=: distdir)
make[1]: Entering directory `/home/gitlab-runner/builds/b4b9a09d/0/igor/crown-core/build/src'
make[1]: *** No rule to make target `mn-pos/proofpointer.h', needed by `distdir'. Stop.
make[1]: Leaving directory `/home/gitlab-runner/builds/b4b9a09d/0/igor/crown-core/build/src'
make: *** [distdir] Error 1
ERROR: Job failed: exit status 1
failed
Linux32-snapshot Build
if test -d "crown-i686-pc-linux-gnu"; then find "crown-i686-pc-linux-gnu" -type d ! -perm -200 -exec chmod u+w {} ';' && rm -rf "crown-i686-pc-linux-gnu" || { sleep 5 && rm -rf "crown-i686-pc-linux-gnu"; }; else :; fi
test -d "crown-i686-pc-linux-gnu" || mkdir "crown-i686-pc-linux-gnu"
(cd src && make top_distdir=../crown-i686-pc-linux-gnu distdir=../crown-i686-pc-linux-gnu/src \
am__remove_distdir=: am__skip_length_check=: am__skip_mode_fix=: distdir)
make[1]: Entering directory `/home/gitlab-runner/builds/b4b9a09d/0/igor/crown-core/build/src'
make[1]: *** No rule to make target `mn-pos/proofpointer.h', needed by `distdir'. Stop.
make[1]: Leaving directory `/home/gitlab-runner/builds/b4b9a09d/0/igor/crown-core/build/src'
make: *** [distdir] Error 1
ERROR: Job failed: exit status 1
failed
Linux64-snapshot Build
if test -d "crown-x86_64-unknown-linux-gnu"; then find "crown-x86_64-unknown-linux-gnu" -type d ! -perm -200 -exec chmod u+w {} ';' && rm -rf "crown-x86_64-unknown-linux-gnu" || { sleep 5 && rm -rf "crown-x86_64-unknown-linux-gnu"; }; else :; fi
test -d "crown-x86_64-unknown-linux-gnu" || mkdir "crown-x86_64-unknown-linux-gnu"
(cd src && make top_distdir=../crown-x86_64-unknown-linux-gnu distdir=../crown-x86_64-unknown-linux-gnu/src \
am__remove_distdir=: am__skip_length_check=: am__skip_mode_fix=: distdir)
make[1]: Entering directory `/home/gitlab-runner/builds/b4b9a09d/0/igor/crown-core/build/src'
make[1]: *** No rule to make target `mn-pos/proofpointer.h', needed by `distdir'. Stop.
make[1]: Leaving directory `/home/gitlab-runner/builds/b4b9a09d/0/igor/crown-core/build/src'
make: *** [distdir] Error 1
ERROR: Job failed: exit status 1
failed
Win32-snapshot Build
if test -d "crown-i686-w64-mingw32"; then find "crown-i686-w64-mingw32" -type d ! -perm -200 -exec chmod u+w {} ';' && rm -rf "crown-i686-w64-mingw32" || { sleep 5 && rm -rf "crown-i686-w64-mingw32"; }; else :; fi
test -d "crown-i686-w64-mingw32" || mkdir "crown-i686-w64-mingw32"
(cd src && make top_distdir=../crown-i686-w64-mingw32 distdir=../crown-i686-w64-mingw32/src \
am__remove_distdir=: am__skip_length_check=: am__skip_mode_fix=: distdir)
make[1]: Entering directory `/home/gitlab-runner/builds/b4b9a09d/0/igor/crown-core/build/src'
make[1]: *** No rule to make target `mn-pos/proofpointer.h', needed by `distdir'. Stop.
make[1]: Leaving directory `/home/gitlab-runner/builds/b4b9a09d/0/igor/crown-core/build/src'
make: *** [distdir] Error 1
ERROR: Job failed: exit status 1
failed
Win64-snapshot Build
if test -d "crown-x86_64-w64-mingw32"; then find "crown-x86_64-w64-mingw32" -type d ! -perm -200 -exec chmod u+w {} ';' && rm -rf "crown-x86_64-w64-mingw32" || { sleep 5 && rm -rf "crown-x86_64-w64-mingw32"; }; else :; fi
test -d "crown-x86_64-w64-mingw32" || mkdir "crown-x86_64-w64-mingw32"
(cd src && make top_distdir=../crown-x86_64-w64-mingw32 distdir=../crown-x86_64-w64-mingw32/src \
am__remove_distdir=: am__skip_length_check=: am__skip_mode_fix=: distdir)
make[1]: Entering directory `/home/gitlab-runner/builds/b4b9a09d/0/igor/crown-core/build/src'
make[1]: *** No rule to make target `mn-pos/proofpointer.h', needed by `distdir'. Stop.
make[1]: Leaving directory `/home/gitlab-runner/builds/b4b9a09d/0/igor/crown-core/build/src'
make: *** [distdir] Error 1
ERROR: Job failed: exit status 1